Reaction Details
Target5-hydroxytryptamine receptor 3A
LigandBDBM50397288
Substrate/Competitorn/a
Meas. Tech.ChEMBL_864726 (CHEMBL2174993)
Ki 1.62±n/a nM
Citation Verheij, MHThompson, AJvan Muijlwijk-Koezen, JELummis, SCLeurs, Rde Esch, IJ Design, synthesis, and structure-activity relationships of highly potent 5-HT3 receptor ligands. J Med Chem55:8603-14 (2012) 
 
5-hydroxytryptamine receptor 3A
Name:5-hydroxytryptamine receptor 3A
Type:Protein
Mol. Mass.:55283.27
Organism:Homo sapiens (Human)
Description:P46098
Residue:478
BDBM50397288
NameBDBM50397288
Synonyms:CHEMBL2169966
TypeSmall organic molecule
Emp. Form.C14H17N3
Mol. Mass.227.3049
SMILESCN1CCN(CC1)c1cc2ccccc2cn1