Reaction Details
Target5-hydroxytryptamine receptor 3A
LigandBDBM50397291
Substrate/Competitorn/a
Meas. Tech.ChEMBL_864726 (CHEMBL2174993)
Ki 1.35±n/a nM
Citation Verheij, MHThompson, AJvan Muijlwijk-Koezen, JELummis, SCLeurs, Rde Esch, IJ Design, synthesis, and structure-activity relationships of highly potent 5-HT3 receptor ligands. J Med Chem55:8603-14 (2012) 
 
5-hydroxytryptamine receptor 3A
Name:5-hydroxytryptamine receptor 3A
Type:Protein
Mol. Mass.:55283.27
Organism:Homo sapiens (Human)
Description:P46098
Residue:478
BDBM50397291
NameBDBM50397291
Synonyms:CHEMBL443764 | VUF-10249
TypeSmall organic molecule
Emp. Form.C13H16N4
Mol. Mass.228.2929
SMILESCN1CCN(CC1)c1ncc2ccccc2n1