Reaction Details
Target5-hydroxytryptamine receptor 3A
LigandBDBM50397298
Substrate/Competitorn/a
Meas. Tech.ChEMBL_864726 (CHEMBL2174993)
Ki 165.96±n/a nM
Citation Verheij, MHThompson, AJvan Muijlwijk-Koezen, JELummis, SCLeurs, Rde Esch, IJ Design, synthesis, and structure-activity relationships of highly potent 5-HT3 receptor ligands. J Med Chem55:8603-14 (2012) 
 
5-hydroxytryptamine receptor 3A
Name:5-hydroxytryptamine receptor 3A
Type:Protein
Mol. Mass.:55283.27
Organism:Homo sapiens (Human)
Description:P46098
Residue:478
BDBM50397298
NameBDBM50397298
Synonyms:CHEMBL490073 | VUF-10452
TypeSmall organic molecule
Emp. Form.C16H22ClN5
Mol. Mass.319.832
SMILESCC(C)Nc1nc(nc2ccc(Cl)cc12)N1CCN(C)CC1