Reaction Details
Target5-hydroxytryptamine receptor 3A
LigandBDBM50397305
Substrate/Competitorn/a
Meas. Tech.ChEMBL_864726 (CHEMBL2174993)
Ki 2344.23±n/a nM
Citation Verheij, MHThompson, AJvan Muijlwijk-Koezen, JELummis, SCLeurs, Rde Esch, IJ Design, synthesis, and structure-activity relationships of highly potent 5-HT3 receptor ligands. J Med Chem55:8603-14 (2012) 
 
5-hydroxytryptamine receptor 3A
Name:5-hydroxytryptamine receptor 3A
Type:Protein
Mol. Mass.:55283.27
Organism:Homo sapiens (Human)
Description:P46098
Residue:478
BDBM50397305
NameBDBM50397305
Synonyms:CHEMBL461360
TypeSmall organic molecule
Emp. Form.C13H16ClN5
Mol. Mass.277.753
SMILESCNc1nc(nc2ccc(Cl)cc12)N1CC[C@H](N)C1