Reaction Details
TargetTyrosyl-DNA phosphodiesterase 1
LigandBDBM4301
Substrate/Competitorn/a
Meas. Tech.ChEMBL_864727 (CHEMBL2174994)
IC50>333000±n/a nM
Citation Sirivolu, VRVernekar, SKMarchand, CNaumova, AChergui, ARenaud, AStephen, AGChen, FSham, YYPommier, YWang, Z 5-Arylidenethioxothiazolidinones as inhibitors of tyrosyl-DNA phosphodiesterase I. J Med Chem55:8671-84 (2012) 
 
Tyrosyl-DNA phosphodiesterase 1
Name:Tyrosyl-DNA phosphodiesterase 1
Type:Enzyme
Mol. Mass.:68430.66
Organism:Homo sapiens (Human)
Description:Q9NUW8
Residue:608
BDBM4301
NameBDBM4301
Synonyms:(2E)-2-cyano-3-(3,4-dihydroxyphenyl)prop-2-enamide Tyrphostin deriv. 40 | benzylidenemalononitrile (BMN) deriv. 46
TypeSmall organic molecule
Emp. Form.C10H8N2O3
Mol. Mass.204.1821
SMILESNC(=O)C(=C\c1ccc(O)c(O)c1)\C#N