Reaction Details
TargetHistone deacetylase 1
LigandBDBM50397359
Substrate/Competitorn/a
Meas. Tech.ChEMBL_864739 (CHEMBL2175006)
IC50 111000±n/a nM
Citation Vaidya, ASNeelarapu, RMadriaga, ABai, HMendonca, EAbdelkarim, Hvan Breemen, RBBlond, SYPetukhov, PA Novel histone deacetylase 8 ligands without a zinc chelating group: exploring an 'upside-down' binding pose. Bioorg Med Chem Lett22:6621-7 (2012) 
 
Histone deacetylase 1
Name:Histone deacetylase 1
Type:Enzyme
Mol. Mass.:55090.27
Organism:Homo sapiens (Human)
Description:Q13547
Residue:482
BDBM50397359
NameBDBM50397359
Synonyms:CHEMBL2170173
TypeSmall organic molecule
Emp. Form.C24H29N7O5
Mol. Mass.495.531
SMILESCOc1cc(COc2ccc(NC(=O)CCCCCCC(=O)OCCN=[N+]=[N-])cc2)cc(c1)N=[N+]=[N-]