Reaction Details
TargetHistone deacetylase 3
LigandBDBM50299972
Substrate/Competitorn/a
Meas. Tech.ChEMBL_864738 (CHEMBL2175005)
IC50 1480±n/a nM
Citation Vaidya, ASNeelarapu, RMadriaga, ABai, HMendonca, EAbdelkarim, Hvan Breemen, RBBlond, SYPetukhov, PA Novel histone deacetylase 8 ligands without a zinc chelating group: exploring an 'upside-down' binding pose. Bioorg Med Chem Lett22:6621-7 (2012) 
 
Histone deacetylase 3
Name:Histone deacetylase 3
Type:Enzyme
Mol. Mass.:48829.55
Organism:Homo sapiens (Human)
Description:O15379
Residue:428
BDBM50299972
NameBDBM50299972
Synonyms:CHEMBL585164 | Octanedioic Acid [4-(3-Azido-5-azidomethylbenzyloxy)phenyl]-amide Hydroxyamide
TypeSmall organic molecule
Emp. Form.C22H26N8O4
Mol. Mass.466.493
SMILESONC(=O)CCCCCCC(=O)Nc1ccc(OCc2cc(CN=[N+]=[N-])cc(c2)N=[N+]=[N-])cc1