Reaction Details
TargetHistone deacetylase 8
LigandBDBM50397362
Substrate/Competitorn/a
Meas. Tech.ChEMBL_864759 (CHEMBL2175141)
IC50 36000±n/a nM
Citation Vaidya, ASNeelarapu, RMadriaga, ABai, HMendonca, EAbdelkarim, Hvan Breemen, RBBlond, SYPetukhov, PA Novel histone deacetylase 8 ligands without a zinc chelating group: exploring an 'upside-down' binding pose. Bioorg Med Chem Lett22:6621-7 (2012) 
 
Histone deacetylase 8
Name:Histone deacetylase 8
Type:Enzyme
Mol. Mass.:41749.60
Organism:Homo sapiens (Human)
Description:Q9BY41
Residue:377
BDBM50397362
NameBDBM50397362
Synonyms:CHEMBL2170175
TypeSmall organic molecule
Emp. Form.C20H25N9O3
Mol. Mass.439.471
SMILESCOC(=O)CCCCCCC(=O)Nc1cnn(Cc2cc(CN=[N+]=[N-])cc(c2)N=[N+]=[N-])c1