Reaction Details
TargetHistone deacetylase 8
LigandBDBM50397363
Substrate/Competitorn/a
Meas. Tech.ChEMBL_864759 (CHEMBL2175141)
IC50 53200±n/a nM
Citation Vaidya, ASNeelarapu, RMadriaga, ABai, HMendonca, EAbdelkarim, Hvan Breemen, RBBlond, SYPetukhov, PA Novel histone deacetylase 8 ligands without a zinc chelating group: exploring an 'upside-down' binding pose. Bioorg Med Chem Lett22:6621-7 (2012) 
 
Histone deacetylase 8
Name:Histone deacetylase 8
Type:Enzyme
Mol. Mass.:41749.60
Organism:Homo sapiens (Human)
Description:Q9BY41
Residue:377
BDBM50397363
NameBDBM50397363
Synonyms:CHEMBL2170172
TypeSmall organic molecule
Emp. Form.C27H37NO4
Mol. Mass.439.587
SMILESCc1cc(C)cc(COc2ccc(NC(=O)CCCCCCC(=O)OC(C)(C)C)cc2)c1