Reaction Details
TargetHistone deacetylase 8
LigandBDBM50299972
Substrate/Competitorn/a
Meas. Tech.ChEMBL_864759 (CHEMBL2175141)
IC50 7340±n/a nM
Citation Vaidya, ASNeelarapu, RMadriaga, ABai, HMendonca, EAbdelkarim, Hvan Breemen, RBBlond, SYPetukhov, PA Novel histone deacetylase 8 ligands without a zinc chelating group: exploring an 'upside-down' binding pose. Bioorg Med Chem Lett22:6621-7 (2012) 
 
Histone deacetylase 8
Name:Histone deacetylase 8
Type:Enzyme
Mol. Mass.:41749.60
Organism:Homo sapiens (Human)
Description:Q9BY41
Residue:377
BDBM50299972
NameBDBM50299972
Synonyms:CHEMBL585164 | Octanedioic Acid [4-(3-Azido-5-azidomethylbenzyloxy)phenyl]-amide Hydroxyamide
TypeSmall organic molecule
Emp. Form.C22H26N8O4
Mol. Mass.466.493
SMILESONC(=O)CCCCCCC(=O)Nc1ccc(OCc2cc(CN=[N+]=[N-])cc(c2)N=[N+]=[N-])cc1