Reaction Details
TargetCannabinoid receptor 2
LigandBDBM50397403
Substrate/Competitorn/a
Meas. Tech.ChEMBL_864944 (CHEMBL2175894)
Ki 195.8±n/a nM
Citation El Bakali, JGilleron, PBody-Malapel, MMansouri, RMuccioli, GGDjouina, MBarczyk, AKlupsch, FAndrzejak, VLipka, EFurman, CLambert, DMChavatte, PDesreumaux, PMillet, R 4-Oxo-1,4-dihydropyridines as selective CB2 cannabinoid receptor ligands. Part 2: discovery of new agonists endowed with protective effect against experimental colitis. J Med Chem55:8948-52 (2012) 
 
Cannabinoid receptor 2
Name:Cannabinoid receptor 2
Type:G Protein-Coupled Receptor (GPCR)
Mol. Mass.:39690.94
Organism:Homo sapiens (Human)
Description:P34972
Residue:360
BDBM50397403
NameBDBM50397403
Synonyms:CHEMBL2170533
TypeSmall organic molecule
Emp. Form.C24H34N2O3
Mol. Mass.398.5384
SMILESCc1cc(=O)c(cn1CCC1CCOCC1)C(=O)NC12CC3CC(CC(C3)C1)C2