Reaction Details
TargetCannabinoid receptor 2
LigandBDBM50397397
Substrate/Competitorn/a
Meas. Tech.ChEMBL_864944 (CHEMBL2175894)
Ki 10.2±n/a nM
Citation El Bakali, JGilleron, PBody-Malapel, MMansouri, RMuccioli, GGDjouina, MBarczyk, AKlupsch, FAndrzejak, VLipka, EFurman, CLambert, DMChavatte, PDesreumaux, PMillet, R 4-Oxo-1,4-dihydropyridines as selective CB2 cannabinoid receptor ligands. Part 2: discovery of new agonists endowed with protective effect against experimental colitis. J Med Chem55:8948-52 (2012) 
 
Cannabinoid receptor 2
Name:Cannabinoid receptor 2
Type:G Protein-Coupled Receptor (GPCR)
Mol. Mass.:39690.94
Organism:Homo sapiens (Human)
Description:P34972
Residue:360
BDBM50397397
NameBDBM50397397
Synonyms:CHEMBL2170551
TypeSmall organic molecule
Emp. Form.C26H40N2O2
Mol. Mass.412.608
SMILESCCCCCn1cc(C(=O)NCC23CC4CC(CC(C4)C2)C3)c(=O)cc1C(C)(C)C