Reaction Details
TargetCannabinoid receptor 1
LigandBDBM50397383
Substrate/Competitorn/a
Meas. Tech.ChEMBL_864943 (CHEMBL2175893)
Ki 105.1±n/a nM
Citation El Bakali, JGilleron, PBody-Malapel, MMansouri, RMuccioli, GGDjouina, MBarczyk, AKlupsch, FAndrzejak, VLipka, EFurman, CLambert, DMChavatte, PDesreumaux, PMillet, R 4-Oxo-1,4-dihydropyridines as selective CB2 cannabinoid receptor ligands. Part 2: discovery of new agonists endowed with protective effect against experimental colitis. J Med Chem55:8948-52 (2012) 
 
Cannabinoid receptor 1
Name:Cannabinoid receptor 1
Type:G Protein-Coupled Receptor (GPCR)
Mol. Mass.:52868.96
Organism:Homo sapiens (Human)
Description:P21554
Residue:472
BDBM50397383
NameBDBM50397383
Synonyms:CHEMBL2170526
TypeSmall organic molecule
Emp. Form.C25H36N2O2
Mol. Mass.396.5655
SMILESCCCCCn1cc(C(=O)NC23CC4CC(CC(C4)C2)C3)c(=O)c(C2CC2)c1C