Reaction Details
TargetSterol O-acyltransferase 1
LigandBDBM50005944
Substrate/Competitorn/a
Meas. Tech.ChEMBL_864990 (CHEMBL2176154)
IC50 200±n/a nM
Citation Pokhrel, LMaezawa, INguyen, TDChang, KOJin, LWHua, DH Inhibition of Acyl-CoA: cholesterol acyltransferase (ACAT), overexpression of cholesterol transporter gene, and protection of amyloidß (Aß) oligomers-induced neuronal cell death by tricyclic pyrone molecules. J Med Chem55:8969-73 (2012) 
 
Sterol O-acyltransferase 1
Name:Sterol O-acyltransferase 1
Type:Multi-pass membrane protein may form homo- or heterodimers.
Mol. Mass.:64751.94
Organism:Homo sapiens (Human)
Description:P35610
Residue:550
BDBM50005944
NameBDBM50005944
Synonyms:2,2-Dimethyl-dodecanoic acid (2,4,6-trimethoxy-phenyl)-amide CI-976
TypeSmall organic molecule
Emp. Form.C23H39NO4
Mol. Mass.393.5601
SMILESCCCCCCCCCCC(C)(C)C(=O)Nc1c(OC)cc(OC)cc1OC