Reaction Details
TargetApoptosis regulator Bcl-2
LigandBDBM50397456
Substrate/Competitorn/a
Meas. Tech.ChEMBL_862011 (CHEMBL2173961)
Ki 1.2±n/a nM
Citation Chen, JZhou, HAguilar, ALiu, LBai, LMcEachern, DYang, CYMeagher, JLStuckey, JAWang, S Structure-based discovery of BM-957 as a potent small-molecule inhibitor of Bcl-2 and Bcl-xL capable of achieving complete tumor regression. J Med Chem55:8502-14 (2012) 
 
Apoptosis regulator Bcl-2
Name:Apoptosis regulator Bcl-2
Type:Homodimer or heterodimer
Mol. Mass.:26269.11
Organism:Homo sapiens (Human)
Description:P10415
Residue:239
BDBM50397456
NameBDBM50397456
Synonyms:CHEMBL2170837
TypeSmall organic molecule
Emp. Form.C52H56ClF3N6O7S3
Mol. Mass.1065.68
SMILESCCn1c(C)c(C(O)=O)c(c1-c1ccc(Cl)cc1)-c1cccc(c1)N1CCN(CC1)c1ccc(NS(=O)(=O)c2ccc(N[C@H](CCN3CCC(O)CC3)CSc3ccccc3)c(c2)S(=O)(=O)C(F)(F)F)cc1