Reaction Details
TargetC-C chemokine receptor type 3
LigandBDBM50397496
Substrate/Competitorn/a
Meas. Tech.ChEMBL_862020 (CHEMBL2173970)
Ki 31.62±n/a nM
Citation Bahl, ABarton, PBowers, KBrough, SEvans, RLuckhurst, CAMochel, TPerry, MWRigby, ARiley, RJSanganee, HSisson, ASpringthorpe, B The discovery of CCR3/H1 dual antagonists with reduced hERG risk. Bioorg Med Chem Lett22:6688-93 (2012) 
 
C-C chemokine receptor type 3
Name:C-C chemokine receptor type 3
Type:Enzyme
Mol. Mass.:41053.88
Organism:Homo sapiens (Human)
Description:P51677
Residue:355
BDBM50397496
NameBDBM50397496
Synonyms:CHEMBL2171045
TypeSmall organic molecule
Emp. Form.C24H26Cl2F3N3O4S
Mol. Mass.580.447
SMILESFC(F)(F)c1cccc(c1)S(=O)(=O)NC(=O)N1CCC(CC1)N1CCC(CC1)Oc1ccc(Cl)c(Cl)c1