Reaction Details
TargetC-C chemokine receptor type 3
LigandBDBM50397488
Substrate/Competitorn/a
Meas. Tech.ChEMBL_862020 (CHEMBL2173970)
Ki 19.95±n/a nM
Citation Bahl, ABarton, PBowers, KBrough, SEvans, RLuckhurst, CAMochel, TPerry, MWRigby, ARiley, RJSanganee, HSisson, ASpringthorpe, B The discovery of CCR3/H1 dual antagonists with reduced hERG risk. Bioorg Med Chem Lett22:6688-93 (2012) 
 
C-C chemokine receptor type 3
Name:C-C chemokine receptor type 3
Type:Enzyme
Mol. Mass.:41053.88
Organism:Homo sapiens (Human)
Description:P51677
Residue:355
BDBM50397488
NameBDBM50397488
Synonyms:CHEMBL2171038
TypeSmall organic molecule
Emp. Form.C24H29Cl2N3O4S
Mol. Mass.526.476
SMILESCc1ccccc1S(=O)(=O)NC(=O)N1CCC(CC1)N1CCC(CC1)Oc1ccc(Cl)c(Cl)c1