Reaction Details
TargetC-C chemokine receptor type 3
LigandBDBM50397516
Substrate/Competitorn/a
Meas. Tech.ChEMBL_862020 (CHEMBL2173970)
Ki 5.01±n/a nM
Citation Bahl, ABarton, PBowers, KBrough, SEvans, RLuckhurst, CAMochel, TPerry, MWRigby, ARiley, RJSanganee, HSisson, ASpringthorpe, B The discovery of CCR3/H1 dual antagonists with reduced hERG risk. Bioorg Med Chem Lett22:6688-93 (2012) 
 
C-C chemokine receptor type 3
Name:C-C chemokine receptor type 3
Type:Enzyme
Mol. Mass.:41053.88
Organism:Homo sapiens (Human)
Description:P51677
Residue:355
BDBM50397516
NameBDBM50397516
Synonyms:CHEMBL2171021
TypeSmall organic molecule
Emp. Form.C25H30Cl2N2O4S
Mol. Mass.525.488
SMILESCc1c(Cl)ccc(OC2CCN(CC2)C2CCN(CC2)C(=O)c2cccc(c2)S(C)(=O)=O)c1Cl