Reaction Details
TargetC-C chemokine receptor type 3
LigandBDBM50397517
Substrate/Competitorn/a
Meas. Tech.ChEMBL_862020 (CHEMBL2173970)
Ki 10±n/a nM
Citation Bahl, ABarton, PBowers, KBrough, SEvans, RLuckhurst, CAMochel, TPerry, MWRigby, ARiley, RJSanganee, HSisson, ASpringthorpe, B The discovery of CCR3/H1 dual antagonists with reduced hERG risk. Bioorg Med Chem Lett22:6688-93 (2012) 
 
C-C chemokine receptor type 3
Name:C-C chemokine receptor type 3
Type:Enzyme
Mol. Mass.:41053.88
Organism:Homo sapiens (Human)
Description:P51677
Residue:355
BDBM50397517
NameBDBM50397517
Synonyms:CHEMBL2171020
TypeSmall organic molecule
Emp. Form.C26H27Cl2N3O3
Mol. Mass.500.417
SMILESClc1ccc(OC2CCN(CC2)C2CCN(CC2)C(=O)c2c[nH]c(=O)c3ccccc23)cc1Cl