Reaction Details
TargetC-C chemokine receptor type 3
LigandBDBM50397518
Substrate/Competitorn/a
Meas. Tech.ChEMBL_862020 (CHEMBL2173970)
Ki 50.12±n/a nM
Citation Bahl, ABarton, PBowers, KBrough, SEvans, RLuckhurst, CAMochel, TPerry, MWRigby, ARiley, RJSanganee, HSisson, ASpringthorpe, B The discovery of CCR3/H1 dual antagonists with reduced hERG risk. Bioorg Med Chem Lett22:6688-93 (2012) 
 
C-C chemokine receptor type 3
Name:C-C chemokine receptor type 3
Type:Enzyme
Mol. Mass.:41053.88
Organism:Homo sapiens (Human)
Description:P51677
Residue:355
BDBM50397518
NameBDBM50397518
Synonyms:CHEMBL2171019
TypeSmall organic molecule
Emp. Form.C24H28Cl2N2O4S
Mol. Mass.511.461
SMILESCS(=O)(=O)c1cccc(c1)C(=O)N1CCC(CC1)N1CCC(CC1)Oc1ccc(Cl)c(Cl)c1