Reaction Details
TargetCell division related protein kinase 2
LigandBDBM50397588
Substrate/Competitorn/a
Meas. Tech.ChEMBL_862287 (CHEMBL2173143)
IC50 60±n/a nM
Citation Rotella, DP Recent results in protein kinase inhibition for tropical diseases. Bioorg Med Chem Lett22:6788-93 (2012) 
 
Cell division related protein kinase 2
Name:Cell division related protein kinase 2
Type:PROTEIN
Mol. Mass.:35647.04
Organism:Leishmania major
Description:ChEMBL_862288
Residue:311
BDBM50397588
NameBDBM50397588
Synonyms:CHEMBL2171518
TypeSmall organic molecule
Emp. Form.C20H22N4O
Mol. Mass.334.4149
SMILESCc1cccc(c1)-c1ccc2nc(NC(=O)C3CCCCC3)nn2c1