Reaction Details
TargetCell division related protein kinase 2
LigandBDBM78336
Substrate/Competitorn/a
Meas. Tech.ChEMBL_862287 (CHEMBL2173143)
IC50 11000±n/a nM
Citation Rotella, DP Recent results in protein kinase inhibition for tropical diseases. Bioorg Med Chem Lett22:6788-93 (2012) 
 
Cell division related protein kinase 2
Name:Cell division related protein kinase 2
Type:PROTEIN
Mol. Mass.:35647.04
Organism:Leishmania major
Description:ChEMBL_862288
Residue:311
BDBM78336
NameBDBM78336
Synonyms:(6E)-6-[4-(3-pyridinylmethylamino)-1H-quinazolin-2-ylidene]-1-cyclohexa-2,4-dienone (6E)-6-[4-(pyridin-3-ylmethylamino)-1H-quinazolin-2-ylidene]cyclohexa-2,4-dien-1-one CHEMBL1328065 SMR000415065 | cid_6097933
TypeSmall organic molecule
Emp. Form.C20H16N4O
Mol. Mass.328.3672
SMILESOc1ccccc1-c1nc(NCc2cccnc2)c2ccccc2n1