Reaction Details
TargetCalcium-dependent protein kinase 4
LigandBDBM50383381
Substrate/Competitorn/a
Meas. Tech.ChEMBL_862298 (CHEMBL2173154)
IC50 4±n/a nM
Citation Rotella, DP Recent results in protein kinase inhibition for tropical diseases. Bioorg Med Chem Lett22:6788-93 (2012) 
 
Calcium-dependent protein kinase 4
Name:Calcium-dependent protein kinase 4
Type:PROTEIN
Mol. Mass.:60782.05
Organism:Plasmodium falciparum (isolate 3D7)
Description:ChEMBL_862298
Residue:528
BDBM50383381
NameBDBM50383381
Synonyms:CHEMBL2030554 US10544104, Compound 29 US9765037, Compound 29
TypeSmall organic molecule
Emp. Form.C23H26N6O
Mol. Mass.402.4921
SMILESCCOc1ccc2cc(ccc2c1)-c1nn(CC2CCNCC2)c2ncnc(N)c12