Reaction Details
TargetBromodomain-containing protein 4
LigandBDBM50397610
Substrate/Competitorn/a
Meas. Tech.ChEMBL_873082 (CHEMBL2182558)
IC50 1300±n/a nM
Citation Bamborough, PDiallo, HGoodacre, JDGordon, LLewis, ASeal, JTWilson, DMWoodrow, MDChung, CW Fragment-based discovery of bromodomain inhibitors part 2: optimization of phenylisoxazole sulfonamides. J Med Chem55:587-96 (2012) 
 
Bromodomain-containing protein 4
Name:Bromodomain-containing protein 4
Type:Protein
Mol. Mass.:152264.84
Organism:Homo sapiens (Human)
Description:O60885
Residue:1362
BDBM50397610
NameBDBM50397610
Synonyms:CHEMBL2181704
TypeSmall organic molecule
Emp. Form.C19H26N2O4S
Mol. Mass.378.486
SMILESCCN(C1CCCC1)S(=O)(=O)c1cc(ccc1OC)-c1c(C)noc1C