Reaction Details
TargetBromodomain-containing protein 3
LigandBDBM50397609
Substrate/Competitorn/a
Meas. Tech.ChEMBL_873083 (CHEMBL2182559)
IC50 1100±n/a nM
Citation Bamborough, PDiallo, HGoodacre, JDGordon, LLewis, ASeal, JTWilson, DMWoodrow, MDChung, CW Fragment-based discovery of bromodomain inhibitors part 2: optimization of phenylisoxazole sulfonamides. J Med Chem55:587-96 (2012) 
 
Bromodomain-containing protein 3
Name:Bromodomain-containing protein 3
Type:Protein
Mol. Mass.:79571.81
Organism:Homo sapiens (Human)
Description:Q15059
Residue:726
BDBM50397609
NameBDBM50397609
Synonyms:CHEMBL2181705
TypeSmall organic molecule
Emp. Form.C16H20N2O3S
Mol. Mass.320.407
SMILESCc1noc(C)c1-c1ccc(C)c(c1)S(=O)(=O)N1CCCC1