Reaction Details
TargetBromodomain-containing protein 2
LigandBDBM50397636
Substrate/Competitorn/a
Meas. Tech.ChEMBL_873084 (CHEMBL2182560)
IC50 1900±n/a nM
Citation Bamborough, PDiallo, HGoodacre, JDGordon, LLewis, ASeal, JTWilson, DMWoodrow, MDChung, CW Fragment-based discovery of bromodomain inhibitors part 2: optimization of phenylisoxazole sulfonamides. J Med Chem55:587-96 (2012) 
 
Bromodomain-containing protein 2
Name:Bromodomain-containing protein 2
Type:Protein
Mol. Mass.:88085.95
Organism:Homo sapiens (Human)
Description:P25440
Residue:801
BDBM50397636
NameBDBM50397636
Synonyms:CHEMBL2181720
TypeSmall organic molecule
Emp. Form.C15H18N2O4S
Mol. Mass.322.379
SMILESCOc1ccc(cc1S(=O)(=O)NC1CC1)-c1c(C)noc1C