Reaction Details
TargetBromodomain-containing protein 4
LigandBDBM50397637
Substrate/Competitorn/a
Meas. Tech.ChEMBL_873082 (CHEMBL2182558)
IC50 1000±n/a nM
Citation Bamborough, PDiallo, HGoodacre, JDGordon, LLewis, ASeal, JTWilson, DMWoodrow, MDChung, CW Fragment-based discovery of bromodomain inhibitors part 2: optimization of phenylisoxazole sulfonamides. J Med Chem55:587-96 (2012) 
 
Bromodomain-containing protein 4
Name:Bromodomain-containing protein 4
Type:Protein
Mol. Mass.:152264.84
Organism:Homo sapiens (Human)
Description:O60885
Residue:1362
BDBM50397637
NameBDBM50397637
Synonyms:CHEMBL2181719
TypeSmall organic molecule
Emp. Form.C15H18N2O3S
Mol. Mass.306.38
SMILESCc1noc(C)c1-c1ccc(C)c(c1)S(=O)(=O)NC1CC1