Reaction Details
TargetProstaglandin D2 receptor 2
LigandBDBM50397643
Substrate/Competitorn/a
Meas. Tech.ChEMBL_873095 (CHEMBL2182571)
Ki 0.2±n/a nM
Citation Pettipher, RWhittaker, M Update on the development of antagonists of chemoattractant receptor-homologous molecule expressed on Th2 cells (CRTH2). From lead optimization to clinical proof-of-concept in asthma and allergic rhinitis. J Med Chem55:2915-31 (2012) 
 
Prostaglandin D2 receptor 2
Name:Prostaglandin D2 receptor 2
Type:Enzyme
Mol. Mass.:43295.45
Organism:Homo sapiens (Human)
Description:Q9Y5Y4
Residue:395
BDBM50397643
NameBDBM50397643
Synonyms:CHEMBL2181803
TypeSmall organic molecule
Emp. Form.C18H15F2NO4S2
Mol. Mass.411.443
SMILESCc1c(CC(O)=O)c2ccc(F)cn2c1Sc1ccc(cc1F)S(C)(=O)=O