Reaction Details
TargetProstaglandin D2 receptor 2
LigandBDBM50161745
Substrate/Competitorn/a
Meas. Tech.ChEMBL_873113 (CHEMBL2182589)
IC50 3.6±n/a nM
Citation Pettipher, RWhittaker, M Update on the development of antagonists of chemoattractant receptor-homologous molecule expressed on Th2 cells (CRTH2). From lead optimization to clinical proof-of-concept in asthma and allergic rhinitis. J Med Chem55:2915-31 (2012) 
 
Prostaglandin D2 receptor 2
Name:Prostaglandin D2 receptor 2
Type:Enzyme
Mol. Mass.:43295.45
Organism:Homo sapiens (Human)
Description:Q9Y5Y4
Residue:395
BDBM50161745
NameBDBM50161745
Synonyms:CHEMBL179036 | {3-[((R)-4-Fluoro-benzenesulfonyl)-methyl-amino]-1,2,3,4-tetrahydro-carbazol-9-yl}-acetic acid
TypeSmall organic molecule
Emp. Form.C21H21FN2O4S
Mol. Mass.416.466
SMILESCN([C@@H]1CCc2c(C1)c1ccccc1n2CC(O)=O)S(=O)(=O)c1ccc(F)cc1