Reaction Details
TargetMetabotropic glutamate receptor 2
LigandBDBM50151435
Substrate/Competitorn/a
Meas. Tech.ChEMBL_873130 (CHEMBL2182979)
IC50 20±n/a nM
Citation Wang, JQZhang, ZKuruppu, DBrownell, AL Radiosynthesis of PET radiotracer as a prodrug for imaging group II metabotropic glutamate receptors in vivo. Bioorg Med Chem Lett22:1958-62 (2012) 
 
Metabotropic glutamate receptor 2
Name:Metabotropic glutamate receptor 2
Type:Enzyme
Mol. Mass.:95584.88
Organism:Homo sapiens (Human)
Description:Q14416
Residue:872
BDBM50151435
NameBDBM50151435
Synonyms:(1R,2R,3R,5R,6R)-2-Amino-3-(3,4-dichloro-benzyloxy)-6-fluoro-bicyclo[3.1.0]hexane-2,6-dicarboxylic acid | CHEMBL186453
TypeSmall organic molecule
Emp. Form.C15H14Cl2FNO5
Mol. Mass.378.18
SMILESN[C@@]1([C@H]2[C@@H](C[C@H]1OCc1ccc(Cl)c(Cl)c1)[C@]2(F)C(O)=O)C(O)=O