Reaction Details
TargetBromodomain-containing protein 2
LigandBDBM50380668
Substrate/Competitorn/a
Meas. Tech.ChEMBL_873616 (CHEMBL2187905)
IC50 794.33±n/a nM
Citation Seal, JLamotte, YDonche, FBouillot, AMirguet, OGellibert, FNicodeme, EKrysa, GKirilovsky, JBeinke, SMcCleary, SRioja, IBamborough, PChung, CWGordon, LLewis, TWalker, ALCutler, LLugo, DWilson, DMWitherington, JLee, KPrinjha, RK Identification of a novel series of BET family bromodomain inhibitors: binding mode and profile of I-BET151 (GSK1210151A). Bioorg Med Chem Lett22:2968-72 (2012) 
 
Bromodomain-containing protein 2
Name:Bromodomain-containing protein 2
Type:Protein
Mol. Mass.:88085.95
Organism:Homo sapiens (Human)
Description:P25440
Residue:801
BDBM50380668
NameBDBM50380668
Synonyms:CHEMBL2017269
TypeSmall organic molecule
Emp. Form.C25H25N3O3
Mol. Mass.415.4843
SMILESCc1noc(C)c1-c1ccc2c(Nc3ccccc3C(C)(C)C)c(cnc2c1)C(O)=O