Reaction Details
TargetCytochrome P450 2C9
LigandBDBM50380678
Substrate/Competitorn/a
Meas. Tech.ChEMBL_873609 (CHEMBL2187898)
IC50 1200±n/a nM
Citation Seal, JLamotte, YDonche, FBouillot, AMirguet, OGellibert, FNicodeme, EKrysa, GKirilovsky, JBeinke, SMcCleary, SRioja, IBamborough, PChung, CWGordon, LLewis, TWalker, ALCutler, LLugo, DWilson, DMWitherington, JLee, KPrinjha, RK Identification of a novel series of BET family bromodomain inhibitors: binding mode and profile of I-BET151 (GSK1210151A). Bioorg Med Chem Lett22:2968-72 (2012) 
 
Cytochrome P450 2C9
Name:Cytochrome P450 2C9
Type:Enzyme
Mol. Mass.:55636.33
Organism:Homo sapiens (Human)
Description:P11712
Residue:490
BDBM50380678
NameBDBM50380678
Synonyms:CHEMBL2017285
TypeSmall organic molecule
Emp. Form.C23H20N4O3
Mol. Mass.400.4299
SMILESCOc1cc2c3n(Cc4ccccc4)c(=O)[nH]c3cnc2cc1-c1c(C)noc1C