Reaction Details
TargetAdenosine receptor A3
LigandBDBM50039951
Substrate/Competitorn/a
Meas. Tech.ChEMBL_874127 (CHEMBL2187068)
Ki 2.1±n/a nM
Citation Baraldi, PGPreti, DBorea, PAVarani, K Medicinal chemistry of A3 adenosine receptor modulators: pharmacological activities and therapeutic implications. J Med Chem55:5676-703 (2012) 
 
Adenosine receptor A3
Name:Adenosine receptor A3
Type:G Protein-Coupled Receptor (GPCR)
Mol. Mass.:36197.32
Organism:Homo sapiens (Human)
Description:P0DMS8
Residue:318
BDBM50039951
NameBDBM50039951
Synonyms:2-(4-Methoxy-phenyl)-5H-[1,2,4]triazolo[1,5-a]quinoxalin-4-one CHEMBL99178
TypeSmall organic molecule
Emp. Form.C16H12N4O2
Mol. Mass.292.2921
SMILESCOc1ccc(cc1)-c1nc2n(n1)c1ccccc1[nH]c2=O