Reaction Details
TargetAdenosine receptor A3
LigandBDBM50397728
Substrate/Competitorn/a
Meas. Tech.ChEMBL_874128 (CHEMBL2187069)
Ki 1.6±n/a nM
Citation Baraldi, PGPreti, DBorea, PAVarani, K Medicinal chemistry of A3 adenosine receptor modulators: pharmacological activities and therapeutic implications. J Med Chem55:5676-703 (2012) 
 
Adenosine receptor A3
Name:Adenosine receptor A3
Type:PROTEIN
Mol. Mass.:36643.73
Organism:Rattus norvegicus
Description:ChEMBL_479910
Residue:320
BDBM50397728
NameBDBM50397728
Synonyms:CHEMBL2181976
TypeSmall organic molecule
Emp. Form.C22H18N4OS
Mol. Mass.386.47
SMILESCc1cc(C)cc(c1)-c1nc(NC(=O)c2cccnc2)sc1-c1ccncc1