Reaction Details
TargetAdenosine receptor A3
LigandBDBM21221
Substrate/Competitorn/a
Meas. Tech.ChEMBL_874127 (CHEMBL2187068)
Ki 2.2±n/a nM
Citation Baraldi, PGPreti, DBorea, PAVarani, K Medicinal chemistry of A3 adenosine receptor modulators: pharmacological activities and therapeutic implications. J Med Chem55:5676-703 (2012) 
 
Adenosine receptor A3
Name:Adenosine receptor A3
Type:G Protein-Coupled Receptor (GPCR)
Mol. Mass.:36197.32
Organism:Homo sapiens (Human)
Description:P0DMS8
Residue:318
BDBM21221
NameBDBM21221
Synonyms:(2S,3S,4R,5R)-5-(2-chloro-6-{[(3-iodophenyl)methyl]amino}-9H-purin-9-yl)-3,4-dihydroxy-N-methyloxolane-2-carboxamide 2-chloro-N6-(3-iodobenzyl)adenosine-5-N-methylcarboxamide C1-IB-MECA CI-IB-MECA US20230364057, Compound 76
TypeSmall organic molecule
Emp. Form.C18H18ClIN6O4
Mol. Mass.544.731
SMILESCNC(=O)[C@H]1O[C@H]([C@H](O)[C@@H]1O)n1cnc2c(NCc3cccc(I)c3)nc(Cl)nc12