Reaction Details
TargetGlycogen synthase kinase-3 beta
LigandBDBM50397746
Substrate/Competitorn/a
Meas. Tech.ChEMBL_874339 (CHEMBL2182637)
Ki 2±n/a nM
Citation Berg, SBergh, MHellberg, SHögdin, KLo-Alfredsson, YSöderman, Pvon Berg, SWeigelt, TOrmö, MXue, YTucker, JNeelissen, JJerning, ENilsson, YBhat, R Discovery of novel potent and highly selective glycogen synthase kinase-3ß (GSK3ß) inhibitors for Alzheimer's disease: design, synthesis, and characterization of pyrazines. J Med Chem55:9107-19 (2012) 
 
Glycogen synthase kinase-3 beta
Name:Glycogen synthase kinase-3 beta
Type:Enzyme
Mol. Mass.:46756.38
Organism:Homo sapiens (Human)
Description:P49841
Residue:420
BDBM50397746
NameBDBM50397746
Synonyms:CHEMBL2177159
TypeSmall organic molecule
Emp. Form.C19H20N6O4S
Mol. Mass.428.465
SMILESCOCCNS(=O)(=O)c1ccc(cc1)-c1cnc(N)c(n1)C(=O)Nc1cccnc1