Reaction Details
TargetCellular tumor antigen p53
LigandBDBM50397773
Substrate/Competitorn/a
Meas. Tech.ChEMBL_874346 (CHEMBL2182644)
IC50 5500±n/a nM
Citation Rew, YSun, DGonzalez-Lopez De Turiso, FBartberger, MDBeck, HPCanon, JChen, AChow, DDeignan, JFox, BMGustin, DHuang, XJiang, MJiao, XJin, LKayser, FKopecky, DJLi, YLo, MCLong, AMMichelsen, KOliner, JDOsgood, TRagains, MSaiki, AYSchneider, SToteva, MYakowec, PYan, XYe, QYu, DZhao, XZhou, JMedina, JCOlson, SH Structure-based design of novel inhibitors of the MDM2-p53 interaction. J Med Chem55:4936-54 (2012) 
 
Cellular tumor antigen p53
Name:Cellular tumor antigen p53
Type:fusion protein
Mol. Mass.:43654.73
Organism:Homo sapiens (Human)
Description:The full-length His6-wt-p53 expressed in E. coli was used in assays.
Residue:393
BDBM50397773
NameBDBM50397773
Synonyms:CHEMBL2177190
TypeSmall organic molecule
Emp. Form.C25H29Cl2NO3
Mol. Mass.462.409
SMILESCCC(CC)N1[C@@H]([C@H](C[C@](C)(CC(O)=O)C1=O)c1cccc(Cl)c1)c1ccc(Cl)cc1