Reaction Details
TargetLeukotriene A-4 hydrolase
LigandBDBM50397955
Substrate/Competitorn/a
Meas. Tech.ChEMBL_872712 (CHEMBL2185125)
Ki>1000000±n/a nM
Citation Albrecht, SSalomon, EDefoin, ATarnus, C Rapid and efficient synthesis of a novel series of substituted aminobenzosuberone derivatives as potent, selective, non-peptidic neutral aminopeptidase inhibitors. Bioorg Med Chem20:4942-53 (2012) 
 
Leukotriene A-4 hydrolase
Name:Leukotriene A-4 hydrolase
Type:Hydrolase; metalloprotease
Mol. Mass.:69280.41
Organism:Homo sapiens (Human)
Description:Human recombinant LTA4H.
Residue:611
BDBM50397955
NameBDBM50397955
Synonyms:CHEMBL2179976
TypeSmall organic molecule
Emp. Form.C11H12FNO
Mol. Mass.193.2175
SMILESN[C@H]1CCc2ccccc2[C@H](F)C1=O