Reaction Details
TargetCytosol aminopeptidase
LigandBDBM50397950
Substrate/Competitorn/a
Meas. Tech.ChEMBL_872713 (CHEMBL2185126)
Ki>100000±n/a nM
Citation Albrecht, SSalomon, EDefoin, ATarnus, C Rapid and efficient synthesis of a novel series of substituted aminobenzosuberone derivatives as potent, selective, non-peptidic neutral aminopeptidase inhibitors. Bioorg Med Chem20:4942-53 (2012) 
 
Cytosol aminopeptidase
Name:Cytosol aminopeptidase
Type:Homohexamer
Mol. Mass.:56288.28
Organism:Bos taurus (bovine)
Description:Bovine kidney LAPc was purchased from Sigma Chemical Co.
Residue:519
BDBM50397950
NameBDBM50397950
Synonyms:CHEMBL2179972
TypeSmall organic molecule
Emp. Form.C18H19NO
Mol. Mass.265.3496
SMILESN[C@H]1CCc2ccccc2[C@@H](Cc2ccccc2)C1=O