Reaction Details
TargetCytosol aminopeptidase
LigandBDBM23971
Substrate/Competitorn/a
Meas. Tech.ChEMBL_872713 (CHEMBL2185126)
Ki 500±n/a nM
Citation Albrecht, SSalomon, EDefoin, ATarnus, C Rapid and efficient synthesis of a novel series of substituted aminobenzosuberone derivatives as potent, selective, non-peptidic neutral aminopeptidase inhibitors. Bioorg Med Chem20:4942-53 (2012) 
 
Cytosol aminopeptidase
Name:Cytosol aminopeptidase
Type:Homohexamer
Mol. Mass.:56288.28
Organism:Bos taurus (bovine)
Description:Bovine kidney LAPc was purchased from Sigma Chemical Co.
Residue:519
BDBM23971
NameBDBM23971
Synonyms:(2S)-2-[(2S,3R)-3-amino-2-hydroxy-4-phenylbutanamido]-4-methylpentanoic acid CHEMBL29292 | Ubenimex
TypeSmall organic molecule
Emp. Form.C16H24N2O4
Mol. Mass.308.3728
SMILESCC(C)C[C@H](NC(=O)[C@@H](O)[C@H](N)Cc1ccccc1)C(O)=O