Reaction Details
TargetLysosomal alpha-glucosidase
LigandBDBM50398022
Substrate/Competitorn/a
Meas. Tech.ChEMBL_873176 (CHEMBL2183407)
IC50 1460±n/a nM
Citation Xiao, JWestbroek, WMotabar, OLea, WAHu, XVelayati, AZheng, WSouthall, NGustafson, AMGoldin, ESidransky, ELiu, KSimeonov, ATamargo, RJRibes, AMatalonga, LFerrer, MMarugan, JJ Discovery of a novel noniminosugar acida glucosidase chaperone series. J Med Chem55:7546-59 (2012) 
 
Lysosomal alpha-glucosidase
Name:Lysosomal alpha-glucosidase
Type:PROTEIN
Mol. Mass.:105312.45
Organism:Homo sapiens (Human)
Description:ChEMBL_1506060
Residue:952
BDBM50398022
NameBDBM50398022
Synonyms:CHEMBL2181097
TypeSmall organic molecule
Emp. Form.C19H19N3O5S
Mol. Mass.401.436
SMILESOC(=O)c1ccc(cc1)N1CCN(CC1)S(=O)(=O)c1ccc2NC(=O)Cc2c1