Reaction Details
TargetCytochrome P450 2C19
LigandBDBM50398045
Substrate/Competitorn/a
Meas. Tech.ChEMBL_873425 (CHEMBL2186100)
IC50 900±n/a nM
Citation Beaulieu, PLBös, MCordingley, MGChabot, CFazal, GGarneau, MGillard, JRJolicoeur, ELaPlante, SMcKercher, GPoirier, MPoupart, MATsantrizos, YSDuan, JKukolj, G Discovery of the first thumb pocket 1 NS5B polymerase inhibitor (BILB 1941) with demonstrated antiviral activity in patients chronically infected with genotype 1 hepatitis C virus (HCV). J Med Chem55:7650-66 (2012) 
 
Cytochrome P450 2C19
Name:Cytochrome P450 2C19
Type:Enzyme
Mol. Mass.:55935.47
Organism:Homo sapiens (Human)
Description:P33261
Residue:490
BDBM50398045
NameBDBM50398045
Synonyms:CHEMBL2181618
TypeSmall organic molecule
Emp. Form.C35H36N4O4
Mol. Mass.576.6847
SMILESCn1c(c(C2CCCC2)c2ccc(cc12)C(=O)NC1(CCCC1)C(=O)Nc1ccc(\C=C\C(O)=O)cc1)-c1ccccn1