Reaction Details
TargetProgesterone receptor
LigandBDBM50398065
Substrate/Competitorn/a
Meas. Tech.ChEMBL_873660 (CHEMBL2188776)
Ki 478±n/a nM
Citation Piotrowski, DW Mineralocorticoid receptor antagonists for the treatment of hypertension and diabetic nephropathy. J Med Chem55:7957-66 (2012) 
 
Progesterone receptor
Name:Progesterone receptor
Type:Protein
Mol. Mass.:98979.52
Organism:Homo sapiens (Human)
Description:P06401
Residue:933
BDBM50398065
NameBDBM50398065
Synonyms:CHEMBL2181925
TypeSmall organic molecule
Emp. Form.C29H26FN3O3
Mol. Mass.483.5334
SMILESFc1ccc2c(OCc3ccccc3\C2=C/c2ccc3n([C@H]4C[C@H]5COCCN5C4)c(=O)[nH]c3c2)c1