Reaction Details
TargetLysophosphatidic acid receptor 1
LigandBDBM50398096
Substrate/Competitorn/a
Meas. Tech.ChEMBL_873925 (CHEMBL2184761)
IC50 48±n/a nM
Citation Qian, YHamilton, MSidduri, AGabriel, SRen, YPeng, RKondru, RNarayanan, ATruitt, THamid, RChen, YZhang, LFretland, AJSanchez, RAChang, KCLucas, MSchoenfeld, RCLaine, DFuentes, MEStevenson, CSBudd, DC Discovery of highly selective and orally active lysophosphatidic acid receptor-1 antagonists with potent activity on human lung fibroblasts. J Med Chem55:7920-39 (2012) 
 
Lysophosphatidic acid receptor 1
Name:Lysophosphatidic acid receptor 1
Type:Enzyme
Mol. Mass.:41120.55
Organism:Homo sapiens (Human)
Description:Q92633
Residue:364
BDBM50398096
NameBDBM50398096
Synonyms:CHEMBL2182042 | US9321738, 3
TypeSmall organic molecule
Emp. Form.C26H24N4O4
Mol. Mass.456.4932
SMILESC[C@@H](OC(=O)Nc1c(nnn1C)-c1ccc(cc1)-c1ccc(CC(O)=O)cc1)c1ccccc1