Reaction Details
TargetLysophosphatidic acid receptor 3
LigandBDBM50398097
Substrate/Competitorn/a
Meas. Tech.ChEMBL_873924 (CHEMBL2184760)
IC50 6860±n/a nM
Citation Qian, YHamilton, MSidduri, AGabriel, SRen, YPeng, RKondru, RNarayanan, ATruitt, THamid, RChen, YZhang, LFretland, AJSanchez, RAChang, KCLucas, MSchoenfeld, RCLaine, DFuentes, MEStevenson, CSBudd, DC Discovery of highly selective and orally active lysophosphatidic acid receptor-1 antagonists with potent activity on human lung fibroblasts. J Med Chem55:7920-39 (2012) 
 
Lysophosphatidic acid receptor 3
Name:Lysophosphatidic acid receptor 3
Type:Enzyme
Mol. Mass.:40149.72
Organism:Homo sapiens (Human)
Description:Q9UBY5
Residue:353
BDBM50398097
NameBDBM50398097
Synonyms:CHEMBL2182032
TypeSmall organic molecule
Emp. Form.C29H25F3N4O4
Mol. Mass.550.5284
SMILESC[C@@H](OC(=O)Nc1c(C)nnn1-c1ccc(cc1)-c1ccc(cc1)C1(CC1)C(O)=O)c1cccc(c1)C(F)(F)F