Reaction Details
TargetLysophosphatidic acid receptor 1
LigandBDBM50398115
Substrate/Competitorn/a
Meas. Tech.ChEMBL_873925 (CHEMBL2184761)
IC50 23±n/a nM
Citation Qian, YHamilton, MSidduri, AGabriel, SRen, YPeng, RKondru, RNarayanan, ATruitt, THamid, RChen, YZhang, LFretland, AJSanchez, RAChang, KCLucas, MSchoenfeld, RCLaine, DFuentes, MEStevenson, CSBudd, DC Discovery of highly selective and orally active lysophosphatidic acid receptor-1 antagonists with potent activity on human lung fibroblasts. J Med Chem55:7920-39 (2012) 
 
Lysophosphatidic acid receptor 1
Name:Lysophosphatidic acid receptor 1
Type:Enzyme
Mol. Mass.:41120.55
Organism:Homo sapiens (Human)
Description:Q92633
Residue:364
BDBM50398115
NameBDBM50398115
Synonyms:CHEMBL2182038
TypeSmall organic molecule
Emp. Form.C28H26N8O2
Mol. Mass.506.5584
SMILESC[C@@H](OC(=O)Nc1c(C)nnn1-c1ccc(cc1)-c1ccc(cc1)C1(CC1)c1nnn[nH]1)c1ccccc1