Reaction Details
TargetLysophosphatidic acid receptor 1
LigandBDBM50398107
Substrate/Competitorn/a
Meas. Tech.ChEMBL_873925 (CHEMBL2184761)
IC50 3970±n/a nM
Citation Qian, YHamilton, MSidduri, AGabriel, SRen, YPeng, RKondru, RNarayanan, ATruitt, THamid, RChen, YZhang, LFretland, AJSanchez, RAChang, KCLucas, MSchoenfeld, RCLaine, DFuentes, MEStevenson, CSBudd, DC Discovery of highly selective and orally active lysophosphatidic acid receptor-1 antagonists with potent activity on human lung fibroblasts. J Med Chem55:7920-39 (2012) 
 
Lysophosphatidic acid receptor 1
Name:Lysophosphatidic acid receptor 1
Type:Enzyme
Mol. Mass.:41120.55
Organism:Homo sapiens (Human)
Description:Q92633
Residue:364
BDBM50398107
NameBDBM50398107
Synonyms:CHEMBL2182057
TypeSmall organic molecule
Emp. Form.C19H17ClFN3O2
Mol. Mass.373.809
SMILESCC(OC(=O)Nc1c(cnn1C)-c1ccc(F)cc1)c1ccccc1Cl