Reaction Details
TargetMicrotubule-associated protein tau
LigandBDBM50398207
Substrate/Competitorn/a
Meas. Tech.ChEMBL_874179 (CHEMBL2187911)
IC50 4±n/a nM
Citation Boländer, AKieser, DVoss, CBauer, SSchön, CBurgold, SBittner, THölzer, JHeyny-von Haußen, RMall, GGoetschy, VCzech, CKnust, HBerger, RHerms, JHilger, ISchmidt, B Bis(arylvinyl)pyrazines, -pyrimidines, and -pyridazines as imaging agents for tau fibrils andß-amyloid plaques in Alzheimer's disease models. J Med Chem55:9170-80 (2012) 
 
Microtubule-associated protein tau
Name:Microtubule-associated protein tau
Type:Protein
Mol. Mass.:78928.63
Organism:Homo sapiens (Human)
Description:P10636
Residue:758
BDBM50398207
NameBDBM50398207
Synonyms:CHEMBL2181045
TypeSmall organic molecule
Emp. Form.C24H26N4
Mol. Mass.370.49
SMILESCN(C)c1ccc(\C=C\c2cc(\C=C\c3ccc(cc3)N(C)C)ncn2)cc1