Reaction Details
TargetMicrotubule-associated protein tau
LigandBDBM50398210
Substrate/Competitorn/a
Meas. Tech.ChEMBL_874179 (CHEMBL2187911)
IC50 13±n/a nM
Citation Boländer, AKieser, DVoss, CBauer, SSchön, CBurgold, SBittner, THölzer, JHeyny-von Haußen, RMall, GGoetschy, VCzech, CKnust, HBerger, RHerms, JHilger, ISchmidt, B Bis(arylvinyl)pyrazines, -pyrimidines, and -pyridazines as imaging agents for tau fibrils andß-amyloid plaques in Alzheimer's disease models. J Med Chem55:9170-80 (2012) 
 
Microtubule-associated protein tau
Name:Microtubule-associated protein tau
Type:Protein
Mol. Mass.:78928.63
Organism:Homo sapiens (Human)
Description:P10636
Residue:758
BDBM50398210
NameBDBM50398210
Synonyms:CHEMBL2181039
TypeSmall organic molecule
Emp. Form.C22H20N2O2
Mol. Mass.344.4064
SMILESCOc1ccc(\C=C\c2cnc(\C=C\c3ccc(OC)cc3)cn2)cc1