Reaction Details
TargetCannabinoid receptor 1
LigandBDBM50398213
Substrate/Competitorn/a
Meas. Tech.ChEMBL_874193 (CHEMBL2187925)
Ki>10000±n/a nM
Citation Rempel, VVolz, NHinz, SKarcz, TMeliciani, INieger, MWenzel, WBräse, SMüller, CE 7-Alkyl-3-benzylcoumarins: a versatile scaffold for the development of potent and selective cannabinoid receptor agonists and antagonists. J Med Chem55:7967-77 (2012) 
 
Cannabinoid receptor 1
Name:Cannabinoid receptor 1
Type:G Protein-Coupled Receptor (GPCR)
Mol. Mass.:52868.96
Organism:Homo sapiens (Human)
Description:P21554
Residue:472
BDBM50398213
NameBDBM50398213
Synonyms:CHEMBL2181548
TypeSmall organic molecule
Emp. Form.C18H16O3
Mol. Mass.280.3178
SMILESCc1ccc(Cc2cc3c(O)cc(C)cc3oc2=O)cc1